Target
Cytochrome P450 1A1
Ligand
BDBM50108051
Substrate
Meas. Tech.
ChEMBL_51348 (CHEMBL664422)
IC50
1500±n/a nM
Citation
 Kim, SKo, HPark, JEJung, SLee, SKChun, YJ Design, synthesis, and discovery of novel trans-stilbene analogues as potent and selective human cytochrome P450 1B1 inhibitors. J Med Chem 45:160-4 (2001)  
Target
Name:
Cytochrome P450 1A1
Synonyms:
CP1A1_HUMAN CYPIA1 Cytochrome P450 1A1 P450 form 6 P450-P1
Type:
Protein
Mol. Mass.:
58177.23
Organism:
Homo sapiens (Human)
Description:
P04798
Residue:
512
  
Inhibitor
Name:
BDBM50108051
Synonyms:
CHEMBL42427 | N-(2,4-Dimethoxy-phenyl)-3,5-dimethoxy-benzamide
Type:
Small organic molecule
Emp. Form.:
C17H19NO5
Mol. Mass.:
317.3365
SMILES:
COc1ccc(NC(=O)c2cc(OC)cc(OC)c2)c(OC)c1
: