Target
Dopamine beta-hydroxylase
Ligand
BDBM50000439
Substrate
Meas. Tech.
ChEMBL_2022933 (CHEMBL4676746)
IC50
50±n/a nM
Citation
 Lin, SXCurtis, MASperry, J Pyridine alkaloids with activity in the central nervous system. Bioorg Med Chem 28:0 (2020)  
Target
Name:
Dopamine beta-hydroxylase
Synonyms:
DBH | DOPO_BOVIN
Type:
PROTEIN
Mol. Mass.:
68136.39
Organism:
Bos taurus
Description:
ChEMBL_50738
Residue:
610
  
Inhibitor
Name:
BDBM50000439
Synonyms:
5-Butyl-pyridine-2-carboxylic acid CHEMBL24510
Type:
Small organic molecule
Emp. Form.:
C10H13NO2
Mol. Mass.:
179.2157
SMILES:
CCCCc1ccc(nc1)C(O)=O
: