Target
Matrix metalloproteinase-9
Ligand
BDBM50108131
Substrate
Meas. Tech.
ChEMBL_105522 (CHEMBL715231)
IC50
0.260000±n/a nM
Citation
 Wada, CKHolms, JHCurtin, MLDai, YFlorjancic, ASGarland, RBGuo, YHeyman, HRStacey, JRSteinman, DHAlbert, DHBouska, JJElmore, INGoodfellow, CLMarcotte, PATapang, PMorgan, DWMichaelides, MRDavidsen, SK Phenoxyphenyl sulfone N-formylhydroxylamines (retrohydroxamates) as potent, selective, orally bioavailable matrix metalloproteinase inhibitors. J Med Chem 45:219-32 (2001)  
Target
Name:
Matrix metalloproteinase-9
Synonyms:
67 kDa matrix metalloproteinase-9 92 kDa gelatinase CLG4B Gelatinase B MMP9 Matrix metalloproteinase 9 (MMP-9) Matrix metalloproteinase-9 (MMP9)
Type:
Enzyme
Mol. Mass.:
78452.28
Organism:
Homo sapiens (Human)
Description:
P14780
Residue:
707
  
Inhibitor
Name:
BDBM50108131
Synonyms:
CHEMBL307413 | N-Hydroxy-N-{1-hydroxymethyl-2-[4-(4-trifluoromethoxy-phenoxy)-benzenesulfonyl]-ethyl}-formamide
Type:
Small organic molecule
Emp. Form.:
C17H16F3NO7S
Mol. Mass.:
435.372
SMILES:
OCC(CS(=O)(=O)c1ccc(Oc2ccc(OC(F)(F)F)cc2)cc1)N(O)C=O
: