Target
72 kDa type IV collagenase
Ligand
BDBM50108138
Substrate
Meas. Tech.
ChEMBL_104551 (CHEMBL718937)
IC50
0.330000±n/a nM
Citation
 Wada, CKHolms, JHCurtin, MLDai, YFlorjancic, ASGarland, RBGuo, YHeyman, HRStacey, JRSteinman, DHAlbert, DHBouska, JJElmore, INGoodfellow, CLMarcotte, PATapang, PMorgan, DWMichaelides, MRDavidsen, SK Phenoxyphenyl sulfone N-formylhydroxylamines (retrohydroxamates) as potent, selective, orally bioavailable matrix metalloproteinase inhibitors. J Med Chem 45:219-32 (2001)  
Target
Name:
72 kDa type IV collagenase
Synonyms:
72 kDa gelatinase CLG4A Gelatinase A (MMP-2) MMP2_HUMAN Matrix metalloproteinase-2 (MMP 2) Matrix metalloproteinases 2 (MMP-2) | TBE-1
Type:
Enzyme
Mol. Mass.:
73870.36
Organism:
Homo sapiens (Human)
Description:
P08253
Residue:
660
  
Inhibitor
Name:
BDBM50108138
Synonyms:
CHEMBL78052 | N-Hydroxy-N-{3-(4-methanesulfonyl-piperazin-1-yl)-1-[4-(4-trifluoromethoxy-phenoxy)-benzenesulfonylmethyl]-propyl}-formamide
Type:
Small organic molecule
Emp. Form.:
C23H28F3N3O8S2
Mol. Mass.:
595.609
SMILES:
CS(=O)(=O)N1CCN(CCC(CS(=O)(=O)c2ccc(Oc3ccc(OC(F)(F)F)cc3)cc2)N(O)C=O)CC1
: