Target
Transcription activator BRG1
Ligand
BDBM394399
Substrate
Meas. Tech.
ChEMBL_2023966 (CHEMBL4677779)
Kd
36±n/a nM
Citation
 Wanior, MPreuss, FNi, XKrämer, AMathea, SGöbel, THeidenreich, DSimonyi, SKahnt, ASJoerger, ACKnapp, S Pan-SMARCA/PB1 Bromodomain Inhibitors and Their Role in Regulating Adipogenesis. J Med Chem 63:14680-14699 (2020)  
Target
Name:
Transcription activator BRG1
Synonyms:
ATP-dependent helicase SMARCA4 BRG1 Mitotic growth and transcription activator Protein brahma homolog 1 SMCA4_HUMAN SNF2B SWI/SNF-related matrix-associated actin-dependent regulator of chromatin subfamily A member 4
Type:
PROTEIN
Mol. Mass.:
184666.66
Organism:
Homo sapiens (Human)
Description:
ChEMBL_107968
Residue:
1647
  
Inhibitor
Name:
BDBM394399
Synonyms:
US10308614, Example 1 | tert-butyl 4-(3-amino-6-(2-hydroxyphenyl)pyridazin-4-yl)piperazine-1-carboxylate
Type:
Small organic molecule
Emp. Form.:
C19H25N5O3
Mol. Mass.:
371.4335
SMILES:
CC(C)(C)OC(=O)N1CCN(CC1)c1cc(nnc1N)-c1ccccc1O
: