Target
5-hydroxytryptamine receptor 2A
Ligand
BDBM50108653
Substrate
Meas. Tech.
ChEMBL_2469 (CHEMBL617357)
IC50
6600±n/a nM
Citation
 Maier, CAWünsch, B Novel spiropiperidines as highly potent and subtype selective sigma-receptor ligands. Part 1. J Med Chem 45:438-48 (2002)  
Target
Name:
5-hydroxytryptamine receptor 2A
Synonyms:
5-HT-2 5-HT2A 5-hydroxytryptamine receptor 2A (5HT-2A) 5HT2A_HUMAN HTR2A | Serotonin receptor 2A
Type:
undefined
Mol. Mass.:
52607.65
Organism:
Homo sapiens (Human)
Description:
P28223
Residue:
471
  
Inhibitor
Name:
BDBM50108653
Synonyms:
1'-benzyl-3-methoxyspiro[3,4-dihydro-1H-isochromene-1,4'-(hexahydropyridine)] CHEMBL141209
Type:
Small organic molecule
Emp. Form.:
C21H25NO2
Mol. Mass.:
323.4287
SMILES:
COC1Cc2ccccc2C2(CCN(Cc3ccccc3)CC2)O1
: