Target
Cruzipain
Ligand
BDBM50108841
Substrate
Meas. Tech.
ChEMBL_51847 (CHEMBL664070)
Ki
7.5±n/a nM
Citation
 Huang, LLee, AEllman, JA Identification of potent and selective mechanism-based inhibitors of the cysteine protease cruzain using solid-phase parallel synthesis. J Med Chem 45:676-84 (2002)  
Target
Name:
Cruzipain
Synonyms:
CYSP_TRYCR Cruzaine | Major cysteine proteinase
Type:
Protein
Mol. Mass.:
49831.41
Organism:
Trypanosoma cruzi
Description:
P25779
Residue:
467
  
Inhibitor
Name:
BDBM50108841
Synonyms:
CHEMBL161508 benzyl (S)-1-((S)-4-(cyclohexylthio)-3-oxo-1-phenylbutan-2-ylamino)-1-oxo-3-phenylpropan-2-ylcarbamate
Type:
Small organic molecule
Emp. Form.:
C33H38N2O4S
Mol. Mass.:
558.731
SMILES:
O=C(N[C@@H](Cc1ccccc1)C(=O)N[C@@H](Cc1ccccc1)C(=O)CSC1CCCCC1)OCc1ccccc1
: