Target
Cruzipain
Ligand
BDBM50108855
Substrate
Meas. Tech.
ChEMBL_51847 (CHEMBL664070)
Ki
2±n/a nM
Citation
 Huang, LLee, AEllman, JA Identification of potent and selective mechanism-based inhibitors of the cysteine protease cruzain using solid-phase parallel synthesis. J Med Chem 45:676-84 (2002)  
Target
Name:
Cruzipain
Synonyms:
CYSP_TRYCR Cruzaine | Major cysteine proteinase
Type:
Protein
Mol. Mass.:
49831.41
Organism:
Trypanosoma cruzi
Description:
P25779
Residue:
467
  
Inhibitor
Name:
BDBM50108855
Synonyms:
CHEMBL352168 | [1-(3-tert-Butylsulfanyl-2-oxo-1-phenethyl-propylcarbamoyl)-3-methyl-butyl]-carbamic acid pyridin-3-ylmethyl ester
Type:
Small organic molecule
Emp. Form.:
C28H39N3O4S
Mol. Mass.:
513.692
SMILES:
CC(C)C[C@H](NC(=O)OCc1cccnc1)C(=O)N[C@@H](CCc1ccccc1)C(=O)CSC(C)(C)C
: