Target
Cruzipain
Ligand
BDBM50108862
Substrate
Meas. Tech.
ChEMBL_51847 (CHEMBL664070)
Ki
2.5±n/a nM
Citation
 Huang, LLee, AEllman, JA Identification of potent and selective mechanism-based inhibitors of the cysteine protease cruzain using solid-phase parallel synthesis. J Med Chem 45:676-84 (2002)  
Target
Name:
Cruzipain
Synonyms:
CYSP_TRYCR Cruzaine | Major cysteine proteinase
Type:
Protein
Mol. Mass.:
49831.41
Organism:
Trypanosoma cruzi
Description:
P25779
Residue:
467
  
Inhibitor
Name:
BDBM50108862
Synonyms:
CHEMBL161651 benzyl (S)-1-((S)-4-(tert-butylthio)-3-oxo-1-phenylbutan-2-ylamino)-1-oxo-3-phenylpropan-2-ylcarbamate
Type:
Small organic molecule
Emp. Form.:
C31H36N2O4S
Mol. Mass.:
532.694
SMILES:
CC(C)(C)SCC(=O)[C@H](Cc1ccccc1)NC(=O)[C@H](Cc1ccccc1)NC(=O)OCc1ccccc1
: