Target
Protein cereblon
Ligand
BDBM50026472
Substrate
Meas. Tech.
ChEMBL_2025843 (CHEMBL4679656)
IC50
264000±n/a nM
Citation
 Maiwald, SHeim, CHernandez Alvarez, BHartmann, MD Sweet and Blind Spots in E3 Ligase Ligand Space Revealed by a Thermophoresis-Based Assay. ACS Med Chem Lett 12:74-81 (2021)  
Target
Name:
Protein cereblon
Synonyms:
CRBN | CRBN_HUMAN
Type:
PROTEIN
Mol. Mass.:
50537.73
Organism:
Homo sapiens (Human)
Description:
ChEMBL_116917
Residue:
442
  
Inhibitor
Name:
BDBM50026472
Synonyms:
(CH3)2SO CHEMBL504 Dimethylsulfoxid US11866416, Compound DMSO dimethyl sulphoxide methylsulfinylmethane | sulfinylbis(methane)
Type:
Small organic molecule
Emp. Form.:
C2H6OS
Mol. Mass.:
78.133
SMILES:
CS(C)=O
: