Target
Proteinase-activated receptor 1
Ligand
BDBM50109076
Substrate
Meas. Tech.
ChEBML_209247
IC50
360±n/a nM
Citation
 Nantermet, PGBarrow, JCLundell, GFPellicore, JMRittle, KEYoung, MFreidinger, RMConnolly, TMCondra, CKarczewski, JBednar, RAGaul, SLGould, RJPrendergast, KSelnick, HG Discovery of a nonpeptidic small molecule antagonist of the human platelet thrombin receptor (PAR-1). Bioorg Med Chem Lett 12:319-23 (2002)  
Target
Name:
Proteinase-activated receptor 1
Synonyms:
CF2R F2R PAR1 Proteinase activated receptor 1 TR Thrombin receptor/ Proteinase-activated receptor 1(Par-1)
Type:
Protein
Mol. Mass.:
47450.07
Organism:
Homo sapiens (Human)
Description:
P25116
Residue:
425
  
Inhibitor
Name:
BDBM50109076
Synonyms:
(3-Azepan-1-yl-propyl)-naphthalen-1-ylmethyl-(3-phenyl-isoxazol-5-yl)-amine | CHEMBL108604
Type:
Small organic molecule
Emp. Form.:
C29H33N3O
Mol. Mass.:
439.5918
SMILES:
C(CN(Cc1cccc2ccccc12)c1cc(no1)-c1ccccc1)CN1CCCCCC1
: