Target
Protein-tyrosine sulfotransferase 2
Ligand
BDBM50109108
Substrate
Meas. Tech.
ChEBML_211032
IC50
425000±n/a nM
Citation
 Kehoe, JWMaly, DJVerdugo, DEArmstrong, JICook, BNOuyang, YBMoore, KLEllman, JABertozzi, CR Tyrosylprotein sulfotransferase inhibitors generated by combinatorial target-guided ligand assembly. Bioorg Med Chem Lett 12:329-32 (2002)  
Target
Name:
Protein-tyrosine sulfotransferase 2
Synonyms:
TPST2 | TPST2_HUMAN
Type:
PROTEIN
Mol. Mass.:
41925.98
Organism:
Homo sapiens (Human)
Description:
ChEMBL_211032
Residue:
377
  
Inhibitor
Name:
BDBM50109108
Synonyms:
3,5-Dibromo-4-hydroxy-benzaldehyde O-methyl-oxime | CHEMBL112963
Type:
Small organic molecule
Emp. Form.:
C8H7Br2NO2
Mol. Mass.:
308.955
SMILES:
CO\N=C\c1cc(Br)c(O)c(Br)c1
: