Target
Thromboxane-A synthase
Ligand
BDBM50109126
Substrate
Meas. Tech.
ChEBML_209933
IC50
21±n/a nM
Citation
 Fujita, MSeki, TInada, HShimizu, KTakahama, ASano, T Approach to dual-acting platelet activating factor (PAF) receptor antagonist/thromboxane synthase inhibitor (TxSI) based on the link of PAF antagonists and TxSIs. Bioorg Med Chem Lett 12:341-4 (2002)  
Target
Name:
Thromboxane-A synthase
Synonyms:
CYP5 Cytochrome P450 5A1 TBXAS1 TXA synthase TXS Thromboxane A2 Synthase (P450 TxA2) Thromboxane prostanoid Thromboxane-A synthase
Type:
Enzyme
Mol. Mass.:
60524.67
Organism:
Homo sapiens (Human)
Description:
P24557
Residue:
533
  
Inhibitor
Name:
BDBM50109126
Synonyms:
5-[1-Pyridin-3-yl-1-{4-[(2-pyridin-3-yl-thiazolidine-4-carbonyl)-amino]-phenyl}-meth-(E)-ylideneaminooxy]-pentanoic acid ethyl ester | CHEMBL116673
Type:
Small organic molecule
Emp. Form.:
C28H31N5O4S
Mol. Mass.:
533.642
SMILES:
CCOC(=O)CCCCO\N=C(/c1ccc(NC(=O)C2CSC(N2)c2cccnc2)cc1)c1cccnc1
: