Target
Kynureninase
Ligand
BDBM50109155
Substrate
Meas. Tech.
ChEMBL_91729 (CHEMBL702027)
Ki
10000±n/a nM
Citation
 Walsh, HALeslie, PLO'Shea, KCBotting, NP 2-Amino-4-[3'-hydroxyphenyl]-4-hydroxybutanoic acid; a potent inhibitor of rat and recombinant human kynureninase. Bioorg Med Chem Lett 12:361-3 (2002)  
Target
Name:
Kynureninase
Synonyms:
KYNU L-kynurenine hydrolase
Type:
PROTEIN
Mol. Mass.:
52356.52
Organism:
Homo sapiens (Human)
Description:
ChEMBL_91729
Residue:
465
  
Inhibitor
Name:
BDBM50109155
Synonyms:
2-Amino-4-hydroxy-4-(3-hydroxy-phenyl)-butyric acid CHEMBL120534
Type:
Small organic molecule
Emp. Form.:
C10H13NO4
Mol. Mass.:
211.2145
SMILES:
NC(CC(O)c1cccc(O)c1)C(O)=O
: