Target
Gonadotropin-releasing hormone receptor
Ligand
BDBM50109213
Substrate
Meas. Tech.
ChEBML_71587
Ki
2500±n/a nM
Citation
 Zhu, YFStruthers, RSConnors, PJGao, YGross, TDSaunders, JWilcoxen, KReinhart, GJLing, NChen, C Initial structure-activity relationship studies of a novel series of pyrrolo[1,2-a]pyrimid-7-ones as GnRH receptor antagonists. Bioorg Med Chem Lett 12:399-402 (2002)  
Target
Name:
Gonadotropin-releasing hormone receptor
Synonyms:
GNRHR GRHR GnRH-R Gonadotropin-releasing hormone receptor | Gonadotropin-releasing hormone receptor (GnRH)
Type:
Enzyme
Mol. Mass.:
37749.45
Organism:
Homo sapiens (Human)
Description:
P30968
Residue:
328
  
Inhibitor
Name:
BDBM50109213
Synonyms:
8-Cyano-1-(2-fluoro-benzyl)-7-(4-methoxy-phenyl)-6-{[methyl-(2-pyridin-2-yl-ethyl)-amino]-methyl}-4-oxo-1,4-dihydro-pyrrolo[1,2-a]pyrimidine-3-carboxylic acid dicyclopropylmethyl ester | CHEMBL128262
Type:
Small organic molecule
Emp. Form.:
C39H38FN5O4
Mol. Mass.:
659.7485
SMILES:
COc1ccc(cc1)-c1c(CN(C)CCc2ccccn2)n2c(c1C#N)n(Cc1ccccc1F)cc(C(=O)OC(C1CC1)C1CC1)c2=O
: