Target
Hematopoietic prostaglandin D synthase
Ligand
BDBM50550010
Substrate
Meas. Tech.
ChEMBL_2026071 (CHEMBL4679884)
IC50
266±n/a nM
Citation
 Yokoo, HShibata, NNaganuma, MMurakami, YFujii, KIto, TAritake, KNaito, MDemizu, Y Development of a Hematopoietic Prostaglandin D Synthase-Degradation Inducer. ACS Med Chem Lett 12:236-241 (2021)  
Target
Name:
Hematopoietic prostaglandin D synthase
Synonyms:
GSTS Glutathione-requiring prostaglandin D synthase HPGDS Hematopoietic prostaglandin D synthase Hematopoietic prostaglandin D synthase (HPGDS) PTGDS2 Prostaglandin D Synthase
Type:
Enzyme
Mol. Mass.:
23341.07
Organism:
Homo sapiens (Human)
Description:
The protein was expressed in E. coli strain BL21(DE3) with an N-terminal 6-His tag.
Residue:
199
  
Inhibitor
Name:
BDBM50550010
Synonyms:
CHEMBL4762935
Type:
Small organic molecule
Emp. Form.:
C53H63N9O13
Mol. Mass.:
1034.1198
SMILES:
O=C(CCOCCOCCOCCOCCOCCNc1cccc2C(=O)N(C3CCC(=O)NC3=O)C(=O)c12)N1CCN(CC1)C(=O)C1CCN(CC1)c1ccc(NC(=O)c2cnc(Oc3ccccc3)nc2)cc1
: