Target
Transient receptor potential cation channel subfamily V member 6
Ligand
BDBM50550079
Substrate
Meas. Tech.
ChEMBL_2026369 (CHEMBL4680527)
IC50
690±n/a nM
Citation
 Cunha, MRBhardwaj, RCarrel, ALLindinger, SRomanin, CParise-Filho, RHediger, MAReymond, JL Natural product inspired optimization of a selective TRPV6 calcium channel inhibitor. RSC Med Chem 11:1032-1040 (2020)  
Target
Name:
Transient receptor potential cation channel subfamily V member 6
Synonyms:
CaT-L CaT1 ECAC2 TRPV6 | TRPV6_HUMAN
Type:
PROTEIN
Mol. Mass.:
87295.84
Organism:
Homo sapiens (Human)
Description:
ChEMBL_103784
Residue:
765
  
Inhibitor
Name:
BDBM50550079
Synonyms:
CHEMBL4742895
Type:
Small organic molecule
Emp. Form.:
C23H28F3N3O
Mol. Mass.:
419.4831
SMILES:
FC(F)(F)c1ccccc1[C@@H]1CC[C@@H](CC1)N1CCN(Cc2ccc(=O)[nH]c2)CC1
: