Target
Transient receptor potential cation channel subfamily V member 6
Ligand
BDBM50550087
Substrate
Meas. Tech.
ChEMBL_2026369 (CHEMBL4680527)
IC50
430±n/a nM
Citation
 Cunha, MRBhardwaj, RCarrel, ALLindinger, SRomanin, CParise-Filho, RHediger, MAReymond, JL Natural product inspired optimization of a selective TRPV6 calcium channel inhibitor. RSC Med Chem 11:1032-1040 (2020)  
Target
Name:
Transient receptor potential cation channel subfamily V member 6
Synonyms:
CaT-L CaT1 ECAC2 TRPV6 | TRPV6_HUMAN
Type:
PROTEIN
Mol. Mass.:
87295.84
Organism:
Homo sapiens (Human)
Description:
ChEMBL_103784
Residue:
765
  
Inhibitor
Name:
BDBM50550087
Synonyms:
CHEMBL4761058
Type:
Small organic molecule
Emp. Form.:
C24H30N2O3
Mol. Mass.:
394.5066
SMILES:
COc1cc(ccc1O)C(=O)N1CCN(CC1)[C@H]1CC[C@H](CC1)c1ccccc1
: