Target
Transient receptor potential cation channel subfamily V member 6
Ligand
BDBM50550090
Substrate
Meas. Tech.
ChEMBL_2026369 (CHEMBL4680527)
IC50
2400±n/a nM
Citation
 Cunha, MRBhardwaj, RCarrel, ALLindinger, SRomanin, CParise-Filho, RHediger, MAReymond, JL Natural product inspired optimization of a selective TRPV6 calcium channel inhibitor. RSC Med Chem 11:1032-1040 (2020)  
Target
Name:
Transient receptor potential cation channel subfamily V member 6
Synonyms:
CaT-L CaT1 ECAC2 TRPV6 | TRPV6_HUMAN
Type:
PROTEIN
Mol. Mass.:
87295.84
Organism:
Homo sapiens (Human)
Description:
ChEMBL_103784
Residue:
765
  
Inhibitor
Name:
BDBM50550090
Synonyms:
CHEMBL4749205
Type:
Small organic molecule
Emp. Form.:
C22H36N2O2
Mol. Mass.:
360.5334
SMILES:
COc1cc(CN2CCN(CC2)[C@H]2CC[C@H](CC2)C(C)(C)C)ccc1O
: