Target
Adenosine receptor A2b
Ligand
BDBM50109465
Substrate
Meas. Tech.
ChEMBL_30578 (CHEMBL649889)
Ki
34±n/a nM
Citation
 Baraldi, PGCacciari, BMoro, SSpalluto, GPastorin, GDa Ros, TKlotz, KNVarani, KGessi, SBorea, PA Synthesis, biological activity, and molecular modeling investigation of new pyrazolo[4,3-e]-1,2,4-triazolo[1,5-c]pyrimidine derivatives as human A(3) adenosine receptor antagonists. J Med Chem 45:770-80 (2002)  
Target
Name:
Adenosine receptor A2b
Synonyms:
AA2BR_HUMAN ADORA2B Adenosine receptors A2b | Adenosine receptors; A2a & A2b
Type:
G Protein-Coupled Receptor (GPCR)
Mol. Mass.:
36341.22
Organism:
Homo sapiens (Human)
Description:
Residue:
332
  
Inhibitor
Name:
BDBM50109465
Synonyms:
1-(8-Butyl-2-furan-2-yl-8H-pyrazolo[4,3-e][1,2,4]triazolo[1,5-c]pyrimidin-5-yl)-3-(3,4-dichloro-phenyl)-urea CHEMBL352707
Type:
Small organic molecule
Emp. Form.:
C21H18Cl2N8O2
Mol. Mass.:
485.326
SMILES:
CCCCn1cc2c(n1)nc(NC(=O)Nc1ccc(Cl)c(Cl)c1)n1nc(nc21)-c1ccco1
: