Target
Metabotropic glutamate receptor 1
Ligand
BDBM50109658
Substrate
Meas. Tech.
ChEMBL_105738 (CHEMBL716137)
Ki
92000±n/a nM
Citation
 Kromann, HSløk, FAStensbøl, TBBräuner-Osborne, HMadsen, UKrogsgaard-Larsen, P Selective antagonists at group I metabotropic glutamate receptors: synthesis and molecular pharmacology of 4-aryl-3-isoxazolol amino acids. J Med Chem 45:988-91 (2002)  
Target
Name:
Metabotropic glutamate receptor 1
Synonyms:
GRM1_RAT Grm1 Metabotropic glutamate receptor Mglur1 metabotropic glutamate 1/5-D metabotropic glutamate receptor 1 isoform alpha precursor
Type:
Enzyme Catalytic Domain
Mol. Mass.:
133240.47
Organism:
RAT
Description:
metabotropic glutamate 1/2 0 RAT::P23385
Residue:
1199
  
Inhibitor
Name:
BDBM50109658
Synonyms:
2-Amino-3-(3-hydroxy-4-phenethyl-isoxazol-5-yl)-propionic acid | CHEMBL367189
Type:
Small organic molecule
Emp. Form.:
C14H16N2O4
Mol. Mass.:
276.2878
SMILES:
N[C@@H](Cc1o[nH]c(=O)c1CCc1ccccc1)C(O)=O
: