Target
Genome polyprotein/Non-structural protein 4A
Ligand
BDBM50110121
Substrate
Meas. Tech.
ChEMBL_143773 (CHEMBL754264)
Ki
0.010000±n/a nM
Citation
 Colarusso, SGerlach, BKoch, UMuraglia, EConte, IStansfield, IMatassa, VGNarjes, F Evolution, synthesis and SAR of tripeptide alpha-ketoacid inhibitors of the hepatitis C virus NS3/NS4A serine protease. Bioorg Med Chem Lett 12:705-8 (2002)  
Target
Name:
Genome polyprotein/Non-structural protein 4A
Synonyms:
Hepatitis C virus serine protease, NS3/NS4A
Type:
Mol. Mass.:
Description:
ASSAY_ID of ChEMBL is 1969955
Components:
This complex has 2 components.
Component 1
Name:
Non-structural protein 4A
Synonyms:
Hepatitis C virus NS4A protein Non-structural protein 4A
Type:
PROTEIN
Mol. Mass.:
5762.65
Organism:
Hepatitis C virus
Description:
ChEMBL_305334
Residue:
54
  
Component 2
Name:
Genome polyprotein
Synonyms:
Hepatitis C virus NS3 protease/helicase | Hepatitis C virus serine protease, NS3/NS4A
Type:
Protein
Mol. Mass.:
67067.41
Organism:
Hepatitis C virus
Description:
A3EZI9
Residue:
631
  
Inhibitor
Name:
BDBM50110121
Synonyms:
3-[2-(2-{2-[2-(2-Acetylamino-3-carboxy-propionylamino)-4-carboxy-butyrylamino]-3,3-diphenyl-propionylamino}-4-carboxy-butyrylamino)-3-cyclohexyl-propionylamino]-5,5-difluoro-2-oxo-pentanoic acid CHEMBL349186
Type:
Small organic molecule
Emp. Form.:
C45H56F2N6O15
Mol. Mass.:
958.9541
SMILES:
CC(=O)N[C@@H](CC(O)=O)C(=O)N[C@@H](CCC(O)=O)C(=O)N[C@@H](C(c1ccccc1)c1ccccc1)C(=O)N[C@@H](CCC(O)=O)C(=O)N[C@@H](CC1CCCCC1)C(=O)N[C@@H](CC(F)F)C(=O)C(O)=O
: