Target
Adenosine receptor A1
Ligand
BDBM50348176
Substrate
Meas. Tech.
ChEMBL_2028568 (CHEMBL4682726)
Ki
1700±n/a nM
Citation
 Abdelrahman, AYerande, SGNamasivayam, VKlapschinski, TAAlnouri, MWEl-Tayeb, AMüller, CE Substituted 4-phenylthiazoles: Development of potent and selective A Eur J Med Chem 186:0 (2020)  
Target
Name:
Adenosine receptor A1
Synonyms:
A1 adenosine receptor (hA1) AA1R_HUMAN ADORA1 Adenosine A1-receptor Adenosine receptor A1 (hA1) | Adenosine transporter (AdT)
Type:
G Protein-Coupled Receptor (GPCR)
Mol. Mass.:
36520.92
Organism:
Homo sapiens (Human)
Description:
P30542
Residue:
326
  
Inhibitor
Name:
BDBM50348176
Synonyms:
CHEMBL1562432
Type:
Small organic molecule
Emp. Form.:
C16H14Cl3N5O
Mol. Mass.:
398.674
SMILES:
CC[C@@H]1Cn2c(N1)c1nc(nc1n(C)c2=O)-c1cc(Cl)cc(Cl)c1Cl
: