Target
Adenosine receptor A1
Ligand
BDBM50348176
Substrate
Meas. Tech.
ChEMBL_2028569 (CHEMBL4682727)
Ki
805±n/a nM
Citation
 Abdelrahman, AYerande, SGNamasivayam, VKlapschinski, TAAlnouri, MWEl-Tayeb, AMüller, CE Substituted 4-phenylthiazoles: Development of potent and selective A Eur J Med Chem 186:0 (2020)  
Target
Name:
Adenosine receptor A1
Synonyms:
AA1R_RAT ADENOSINE A1 high Adenosine A1 receptor (A1) Adenosine receptors A1 | Adora1
Type:
Protein
Mol. Mass.:
36704.13
Organism:
Rattus norvegicus (rat)
Description:
Residue:
326
  
Inhibitor
Name:
BDBM50348176
Synonyms:
CHEMBL1562432
Type:
Small organic molecule
Emp. Form.:
C16H14Cl3N5O
Mol. Mass.:
398.674
SMILES:
CC[C@@H]1Cn2c(N1)c1nc(nc1n(C)c2=O)-c1cc(Cl)cc(Cl)c1Cl
: