Target
Adenosine receptor A2a
Ligand
BDBM50348176
Substrate
Meas. Tech.
ChEMBL_2028570 (CHEMBL4682728)
Ki
2700±n/a nM
Citation
 Abdelrahman, AYerande, SGNamasivayam, VKlapschinski, TAAlnouri, MWEl-Tayeb, AMüller, CE Substituted 4-phenylthiazoles: Development of potent and selective A Eur J Med Chem 186:0 (2020)  
Target
Name:
Adenosine receptor A2a
Synonyms:
A2A adenosine receptor (hA2A) ADENOSINE A2 ADORA2 Adenosine A2A receptor (A2AAR)
Type:
G Protein-Coupled Receptor (GPCR)
Mol. Mass.:
44716.46
Organism:
Homo sapiens (Human)
Description:
P29274
Residue:
412
  
Inhibitor
Name:
BDBM50348176
Synonyms:
CHEMBL1562432
Type:
Small organic molecule
Emp. Form.:
C16H14Cl3N5O
Mol. Mass.:
398.674
SMILES:
CC[C@@H]1Cn2c(N1)c1nc(nc1n(C)c2=O)-c1cc(Cl)cc(Cl)c1Cl
: