Target
Adenosine receptor A2a
Ligand
BDBM50348176
Substrate
Meas. Tech.
ChEMBL_2028571 (CHEMBL4682729)
Ki
6040±n/a nM
Citation
 Abdelrahman, AYerande, SGNamasivayam, VKlapschinski, TAAlnouri, MWEl-Tayeb, AMüller, CE Substituted 4-phenylthiazoles: Development of potent and selective A Eur J Med Chem 186:0 (2020)  
Target
Name:
Adenosine receptor A2a
Synonyms:
AA2AR_RAT Adenosine A2 receptor Adenosine Receptors A2a (A2a) Adenosine receptors A2a Rat striatal adenosine A2a receptor
Type:
G Protein-Coupled Receptor (GPCR)
Mol. Mass.:
45015.65
Organism:
Rattus norvegicus (rat)
Description:
Rat A2A receptors expressed in CHO cells.
Residue:
410
  
Inhibitor
Name:
BDBM50348176
Synonyms:
CHEMBL1562432
Type:
Small organic molecule
Emp. Form.:
C16H14Cl3N5O
Mol. Mass.:
398.674
SMILES:
CC[C@@H]1Cn2c(N1)c1nc(nc1n(C)c2=O)-c1cc(Cl)cc(Cl)c1Cl
: