Target
TGF-beta receptor type-1
Ligand
BDBM50110202
Substrate
Meas. Tech.
ChEMBL_27998 (CHEMBL642728)
IC50
260±n/a nM
Citation
 Callahan, JFBurgess, JLFornwald, JAGaster, LMHarling, JDHarrington, FPHeer, JKwon, CLehr, RMathur, AOlson, BAWeinstock, JLaping, NJ Identification of novel inhibitors of the transforming growth factor beta1 (TGF-beta1) type 1 receptor (ALK5). J Med Chem 45:999-1001 (2002)  
Target
Name:
TGF-beta receptor type-1
Synonyms:
ALK-5 Activin A receptor type II-like protein kinase of 53kD SKR4 TGF-beta receptor type I TGFBR1 TGFR1_HUMAN Transforming growth factor-beta receptor type I
Type:
enzyme
Mol. Mass.:
55968.24
Organism:
Homo sapiens (Human)
Description:
P36897
Residue:
503
  
Inhibitor
Name:
BDBM50110202
Synonyms:
(4-(4-(benzo[d][1,3]dioxol-5-yl)-5-(pyridin-2-yl)-1H-imidazol-2-yl)phenyl)methanol [4-(4-Benzo[1,3]dioxol-5-yl-5-pyridin-2-yl-1H-imidazol-2-yl)-phenyl]-methanol
Type:
Small organic molecule
Emp. Form.:
C22H17N3O3
Mol. Mass.:
371.3887
SMILES:
OCc1ccc(cc1)-c1nc(c([nH]1)-c1ccc2OCOc2c1)-c1ccccn1
: