Target
Calcitonin receptor
Ligand
BDBM50110276
Substrate
Meas. Tech.
ChEMBL_42740 (CHEMBL654539)
IC50
>5000±n/a nM
Citation
 Taylor, JWJin, QKSbacchi, MWang, LBelfiore, PGarnier, MKazantzis, AKapurniotu, AZaratin, PFScheideler, MA Side-chain lactam-bridge conformational constraints differentiate the activities of salmon and human calcitonins and reveal a new design concept for potent calcitonin analogues. J Med Chem 45:1108-21 (2002)  
Target
Name:
Calcitonin receptor
Synonyms:
C1A/C1B CT-R | Calcr
Type:
PROTEIN
Mol. Mass.:
60302.08
Organism:
Rattus norvegicus
Description:
ChEMBL_42740
Residue:
516
  
Inhibitor
Name:
BDBM50110276
Synonyms:
-amide | CHEMBL2369898
Type:
Small organic molecule
Emp. Form.:
C142H216N38O44S3
Mol. Mass.:
3255.658
SMILES:
CC[C@H](C)[C@H](NC(=O)[C@H](C)NC(=O)[C@@H](NC(=O)[C@H](CCC(N)=O)NC(=O)[C@H]1CCCN1C(=O)[C@H](Cc1ccccc1)NC(=O)[C@@H](N[C@@H](Cc1c[nH]cn1)C(=O)NCC(=O)[C@@H]1CCCN1C(=O)[C@H](CC(N)=O)NC(=O)[C@H](Cc1ccccc1)NC(=O)[C@H](CC(O)=O)NC(=O)[C@H](CCC(N)=O)NC(=O)[C@@H](NC(=O)[C@H](Cc1ccc(O)cc1)NC(=O)[C@@H](NC(=O)CNC(=O)[C@H](CC(C)C)NC(=O)[C@H](CCSC)NC(=O)[C@H](CS)NC(=O)[C@@H](NC(=O)[C@H](CO)NC(=O)[C@H](CC(C)C)NC(=O)[C@H](CC(N)=O)NC(=O)CNC(=O)[C@@H](N)CS)[C@@H](C)O)[C@@H](C)O)[C@@H](C)O)[C@@H](C)O)[C@@H](C)O)C(=O)NCC(=O)N[C@@H](C(C)C)C(=O)NCC(=O)N[C@@H](C)C(=O)N1CCC[C@@H]1C(N)=O
: