Target
Histamine N-methyltransferase
Ligand
BDBM50110286
Substrate
Meas. Tech.
ChEMBL_87238 (CHEMBL696458)
IC50
45±n/a nM
Citation
 Apelt, JLigneau, XPertz, HHArrang, JMGanellin, CRSchwartz, JCSchunack, WStark, H Development of a new class of nonimidazole histamine H(3) receptor ligands with combined inhibitory histamine N-methyltransferase activity. J Med Chem 45:1128-41 (2002)  
Target
Name:
Histamine N-methyltransferase
Synonyms:
HNMT_RAT | Hnmt
Type:
PROTEIN
Mol. Mass.:
33931.03
Organism:
Rattus norvegicus
Description:
ChEMBL_87236
Residue:
295
  
Inhibitor
Name:
BDBM50110286
Synonyms:
(3-Piperidin-1-yl-propyl)-(1,2,3,4-tetrahydro-acridin-9-yl)-amine; Oxalic acid | CHEMBL275617
Type:
Small organic molecule
Emp. Form.:
C21H29N3
Mol. Mass.:
323.4751
SMILES:
C(CNc1c2CCCCc2nc2ccccc12)CN1CCCCC1
: