Target
Histamine N-methyltransferase
Ligand
BDBM50110285
Substrate
Meas. Tech.
ChEMBL_87238 (CHEMBL696458)
IC50
31±n/a nM
Citation
 Apelt, JLigneau, XPertz, HHArrang, JMGanellin, CRSchwartz, JCSchunack, WStark, H Development of a new class of nonimidazole histamine H(3) receptor ligands with combined inhibitory histamine N-methyltransferase activity. J Med Chem 45:1128-41 (2002)  
Target
Name:
Histamine N-methyltransferase
Synonyms:
HNMT_RAT | Hnmt
Type:
PROTEIN
Mol. Mass.:
33931.03
Organism:
Rattus norvegicus
Description:
ChEMBL_87236
Residue:
295
  
Inhibitor
Name:
BDBM50110285
Synonyms:
CHEMBL274041 | {3-[4-(3-Piperidin-1-yl-propoxy)-phenyl]-propyl}-quinolin-4-yl-amine; Oxalic acid
Type:
Small organic molecule
Emp. Form.:
C26H33N3O
Mol. Mass.:
403.5597
SMILES:
C(COc1ccc(CCCNc2ccnc3ccccc23)cc1)CN1CCCCC1
: