Target
Histamine N-methyltransferase
Ligand
BDBM50110302
Substrate
Meas. Tech.
ChEMBL_87238 (CHEMBL696458)
IC50
110±n/a nM
Citation
 Apelt, JLigneau, XPertz, HHArrang, JMGanellin, CRSchwartz, JCSchunack, WStark, H Development of a new class of nonimidazole histamine H(3) receptor ligands with combined inhibitory histamine N-methyltransferase activity. J Med Chem 45:1128-41 (2002)  
Target
Name:
Histamine N-methyltransferase
Synonyms:
HNMT_RAT | Hnmt
Type:
PROTEIN
Mol. Mass.:
33931.03
Organism:
Rattus norvegicus
Description:
ChEMBL_87236
Residue:
295
  
Inhibitor
Name:
BDBM50110302
Synonyms:
Acridin-9-yl-(3-piperidin-1-yl-propyl)-amine; Oxalic acid | CHEMBL277988
Type:
Small organic molecule
Emp. Form.:
C21H25N3
Mol. Mass.:
319.4433
SMILES:
C(CNc1c2ccccc2nc2ccccc12)CN1CCCCC1
: