Target
Histamine N-methyltransferase
Ligand
BDBM50110308
Substrate
Meas. Tech.
ChEMBL_87238 (CHEMBL696458)
IC50
420±n/a nM
Citation
 Apelt, JLigneau, XPertz, HHArrang, JMGanellin, CRSchwartz, JCSchunack, WStark, H Development of a new class of nonimidazole histamine H(3) receptor ligands with combined inhibitory histamine N-methyltransferase activity. J Med Chem 45:1128-41 (2002)  
Target
Name:
Histamine N-methyltransferase
Synonyms:
HNMT_RAT | Hnmt
Type:
PROTEIN
Mol. Mass.:
33931.03
Organism:
Rattus norvegicus
Description:
ChEMBL_87236
Residue:
295
  
Inhibitor
Name:
BDBM50110308
Synonyms:
(7-Chloro-quinolin-4-yl)-{2-[4-(3-piperidin-1-yl-propoxy)-phenyl]-ethyl}-amine; Oxalic acid | CHEMBL14587
Type:
Small organic molecule
Emp. Form.:
C25H30ClN3O
Mol. Mass.:
423.978
SMILES:
Clc1ccc2c(NCCc3ccc(OCCCN4CCCCC4)cc3)ccnc2c1
: