Target
Histamine N-methyltransferase
Ligand
BDBM50110284
Substrate
Meas. Tech.
ChEMBL_87238 (CHEMBL696458)
IC50
64±n/a nM
Citation
 Apelt, JLigneau, XPertz, HHArrang, JMGanellin, CRSchwartz, JCSchunack, WStark, H Development of a new class of nonimidazole histamine H(3) receptor ligands with combined inhibitory histamine N-methyltransferase activity. J Med Chem 45:1128-41 (2002)  
Target
Name:
Histamine N-methyltransferase
Synonyms:
HNMT_RAT | Hnmt
Type:
PROTEIN
Mol. Mass.:
33931.03
Organism:
Rattus norvegicus
Description:
ChEMBL_87236
Residue:
295
  
Inhibitor
Name:
BDBM50110284
Synonyms:
(4-Piperidin-1-yl-butyl)-quinolin-4-yl-amine; Oxalic acid | CHEMBL14524
Type:
Small organic molecule
Emp. Form.:
C18H25N3
Mol. Mass.:
283.4112
SMILES:
C(CCN1CCCCC1)CNc1ccnc2ccccc12
: