Target
Ephrin type-A receptor 1
Ligand
BDBM50551201
Substrate
Meas. Tech.
ChEMBL_2030720 (CHEMBL4684878)
IC50
>30000±n/a nM
Citation
 Incerti, MRusso, SCorrado, MGiorgio, CBallabeni, VChiodelli, PRusnati, MScalvini, LCallegari, DCastelli, RVacondio, FFerlenghi, FTognolini, MLodola, A Optimization of EphA2 antagonists based on a lithocholic acid core led to the identification of UniPR505, a new 3?-carbamoyloxy derivative with antiangiogenetic properties. Eur J Med Chem 189:0 (2020)  
Target
Name:
Ephrin type-A receptor 1
Synonyms:
EPH EPH tyrosine kinase 1 EPHA1_HUMAN EPHT1 Ephrin type-A receptor 1 Erythropoietin-producing hepatoma receptor hEpha1
Type:
Enzyme
Mol. Mass.:
108128.04
Organism:
Homo sapiens (Human)
Description:
P21709
Residue:
976
  
Inhibitor
Name:
BDBM50551201
Synonyms:
CHEMBL4761556
Type:
Small organic molecule
Emp. Form.:
C39H57N3O5
Mol. Mass.:
647.887
SMILES:
[H][C@@]1(CC[C@@]2([H])[C@]3([H])CC[C@]4([H])C[C@@H](CC[C@]4(C)[C@@]3([H])CC[C@]12C)OC(=O)NCC)[C@H](C)CCC(=O)N[C@H](CC(O)=O)Cc1c[nH]c2ccccc12
: