Target
Adenosine receptor A2a
Ligand
BDBM50110991
Substrate
Meas. Tech.
ChEMBL_30137 (CHEMBL641340)
Ki
900±n/a nM
Citation
 Hayallah, AMSandoval-Ramírez, JReith, USchobert, UPreiss, BSchumacher, BDaly, JWMüller, CE 1,8-disubstituted xanthine derivatives: synthesis of potent A2B-selective adenosine receptor antagonists. J Med Chem 45:1500-10 (2002)  
Target
Name:
Adenosine receptor A2a
Synonyms:
AA2AR_RAT Adenosine A2 receptor Adenosine Receptors A2a (A2a) Adenosine receptors A2a Rat striatal adenosine A2a receptor
Type:
G Protein-Coupled Receptor (GPCR)
Mol. Mass.:
45015.65
Organism:
Rattus norvegicus (rat)
Description:
Rat A2A receptors expressed in CHO cells.
Residue:
410
  
Inhibitor
Name:
BDBM50110991
Synonyms:
4-{2-[4-(1-Butyl-2,6-dioxo-2,3,6,7-tetrahydro-1H-purin-8-yl)-phenoxy]-acetyl}-piperazine-1-carboxylic acid ethyl ester | CHEMBL37933
Type:
Small organic molecule
Emp. Form.:
C24H30N6O6
Mol. Mass.:
498.5316
SMILES:
CCCCn1c(=O)[nH]c2nc([nH]c2c1=O)-c1ccc(OCC(=O)N2CCN(CC2)C(=O)OCC)cc1
: