Target
Coagulation factor X
Ligand
BDBM50111661
Substrate
Meas. Tech.
ChEBML_209063
Ki
1±n/a nM
Citation
 St-Denis, YLévesque, SBachand, BEdmunds, JJLeblond, LPréville, PTarazi, MWinocour, PDSiddiqui, MA Novel bicyclic lactam inhibitors of thrombin: highly potent and selective inhibitors. Bioorg Med Chem Lett 12:1181-4 (2002)  
Target
Name:
Coagulation factor X
Synonyms:
Activated coagulation factor X (FXa) Coagulation factor X precursor F10 Factor X heavy chain Factor Xa Stuart-Prower factor
Type:
Enzyme
Mol. Mass.:
54726.60
Organism:
Homo sapiens (Human)
Description:
Residue:
488
  
Inhibitor
Name:
BDBM50111661
Synonyms:
(6S,8aS)-2-(2,2-Diphenyl-ethanesulfonyl)-4-oxo-octahydro-pyrrolo[1,2-a]pyrazine-6-carboxylic acid 4-carbamimidoyl-benzylamide | CHEMBL404833
Type:
Small organic molecule
Emp. Form.:
C30H33N5O4S
Mol. Mass.:
559.679
SMILES:
NC(=N)c1ccc(CNC(=O)[C@@H]2CC[C@H]3CN(CC(=O)N23)S(=O)(=O)CC(c2ccccc2)c2ccccc2)cc1
: