Target
Coagulation factor X
Ligand
BDBM50111663
Substrate
Meas. Tech.
ChEBML_209063
Ki
10±n/a nM
Citation
 St-Denis, YLévesque, SBachand, BEdmunds, JJLeblond, LPréville, PTarazi, MWinocour, PDSiddiqui, MA Novel bicyclic lactam inhibitors of thrombin: highly potent and selective inhibitors. Bioorg Med Chem Lett 12:1181-4 (2002)  
Target
Name:
Coagulation factor X
Synonyms:
Activated coagulation factor X (FXa) Coagulation factor X precursor F10 Factor X heavy chain Factor Xa Stuart-Prower factor
Type:
Enzyme
Mol. Mass.:
54726.60
Organism:
Homo sapiens (Human)
Description:
Residue:
488
  
Inhibitor
Name:
BDBM50111663
Synonyms:
(6S,8aS)-2-(Diphenyl-methanesulfonyl)-4-oxo-octahydro-pyrrolo[1,2-a]pyrazine-6-carboxylic acid (6-amino-2-methyl-pyridin-3-ylmethyl)-amide | CHEMBL17793
Type:
Small organic molecule
Emp. Form.:
C28H31N5O4S
Mol. Mass.:
533.642
SMILES:
Cc1nc(N)ccc1CNC(=O)[C@@H]1CC[C@H]2CN(CC(=O)N12)S(=O)(=O)C(c1ccccc1)c1ccccc1
: