Target
Coagulation factor X
Ligand
BDBM50111676
Substrate
Meas. Tech.
ChEBML_209063
Ki
5±n/a nM
Citation
 St-Denis, YLévesque, SBachand, BEdmunds, JJLeblond, LPréville, PTarazi, MWinocour, PDSiddiqui, MA Novel bicyclic lactam inhibitors of thrombin: highly potent and selective inhibitors. Bioorg Med Chem Lett 12:1181-4 (2002)  
Target
Name:
Coagulation factor X
Synonyms:
Activated coagulation factor X (FXa) Coagulation factor X precursor F10 Factor X heavy chain Factor Xa Stuart-Prower factor
Type:
Enzyme
Mol. Mass.:
54726.60
Organism:
Homo sapiens (Human)
Description:
Residue:
488
  
Inhibitor
Name:
BDBM50111676
Synonyms:
(6S,8aS)-2-(Diphenyl-methanesulfonyl)-4-oxo-octahydro-pyrrolo[1,2-a]pyrazine-6-carboxylic acid (4-amino-cyclohexylmethyl)-amide | CHEMBL415990
Type:
Small organic molecule
Emp. Form.:
C28H36N4O4S
Mol. Mass.:
524.675
SMILES:
N[C@H]1CC[C@H](CNC(=O)[C@@H]2CC[C@H]3CN(CC(=O)N23)S(=O)(=O)C(c2ccccc2)c2ccccc2)CC1
: