Target
Coagulation factor X
Ligand
BDBM50112528
Substrate
Meas. Tech.
ChEBML_49327
Ki
0.400000±n/a nM
Citation
 Shaw, KJGuilford, WJGriedel, BDSakata, STrinh, LWu, SXu, WZhao, ZMorrissey, MM Benzimidazole-based fXa inhibitors with improved thrombin and trypsin selectivity. Bioorg Med Chem Lett 12:1311-4 (2002)  
Target
Name:
Coagulation factor X
Synonyms:
Activated coagulation factor X (FXa) Coagulation factor X precursor F10 Factor X heavy chain Factor Xa Stuart-Prower factor
Type:
Enzyme
Mol. Mass.:
54726.60
Organism:
Homo sapiens (Human)
Description:
Residue:
488
  
Inhibitor
Name:
BDBM50112528
Synonyms:
3-(3-{2-Ethyl-5-[1-(1-imino-ethyl)-piperidin-4-yloxy]-benzoimidazol-1-yl}-propenyl)-phenylamine | CHEMBL25484
Type:
Small organic molecule
Emp. Form.:
C25H31N5O
Mol. Mass.:
417.5465
SMILES:
CCc1nc2cc(OC3CCN(CC3)C(C)=N)ccc2n1CC=Cc1cccc(N)c1
: