Target
Tyrosine-protein kinase Lck
Ligand
BDBM50112913
Substrate
Meas. Tech.
ChEBML_221484
IC50
60±n/a nM
Citation
 Chen, PNorris, DIwanowicz, EJSpergel, SHLin, JGu, HHShen, ZWityak, JLin, TAPang, SDe Fex, HFPitt, SShen, DRDoweyko, AMBassolino, DARoberge, JYPoss, MAChen, BCSchieven, GLBarrish, JC Discovery and initial SAR of imidazoquinoxalines as inhibitors of the Src-family kinase p56(Lck). Bioorg Med Chem Lett 12:1361-4 (2002)  
Target
Name:
Tyrosine-protein kinase Lck
Synonyms:
2.7.10.2 LCK_HUMAN Leukocyte C-terminal Src kinase Lymphocyte-specific protein tyrosine kinase Protein YT16 Proto-oncogene tyrosine-protein kinase LCK T cell-specific protein-tyrosine kinase
Type:
Mol. Mass.:
57987.83
Organism:
Homo sapiens (Human)
Description:
P06239
Residue:
509
  
Inhibitor
Name:
BDBM50112913
Synonyms:
2-Bromo-N-imidazo[1,5-a]quinoxalin-4-yl-benzamide | CHEMBL282587
Type:
Small organic molecule
Emp. Form.:
C17H11BrN4O
Mol. Mass.:
367.199
SMILES:
Brc1ccccc1C(=O)Nc1nc2ccccc2n2cncc12
: