Target
Neuropeptide Y receptor type 1
Ligand
BDBM50553104
Substrate
Meas. Tech.
ChEMBL_2045151 (CHEMBL4699850)
Ki
0.058884±n/a nM
Citation
 Buschmann, JSeiler, TBernhardt, GKeller, MWifling, D Argininamide-type neuropeptide Y Y RSC Med Chem 11:274-282 (2020)  
Target
Name:
Neuropeptide Y receptor type 1
Synonyms:
NPY-Y1 NPY1R NPYR neuropeptide Y receptor Y1
Type:
Enzyme Catalytic Domain
Mol. Mass.:
44399.07
Organism:
Homo sapiens (Human)
Description:
NPY-Y1 NPY1R HUMAN::P25929
Residue:
384
  
Inhibitor
Name:
BDBM50553104
Synonyms:
CHEMBL4743976
Type:
Small organic molecule
Emp. Form.:
C34H40F3N7O7
Mol. Mass.:
715.7193
SMILES:
OC(=O)C(F)(F)F.CC(=O)NCCNC(=O)\N=C(\N)NCCC[C@@H](NC(=O)C(c1ccccc1)c1ccccc1)C(=O)NCc1ccc(O)cc1
: