Target
Neuropeptide Y receptor type 1
Ligand
BDBM50553107
Substrate
Meas. Tech.
ChEMBL_2045151 (CHEMBL4699850)
Ki
0.031623±n/a nM
Citation
 Buschmann, JSeiler, TBernhardt, GKeller, MWifling, D Argininamide-type neuropeptide Y Y RSC Med Chem 11:274-282 (2020)  
Target
Name:
Neuropeptide Y receptor type 1
Synonyms:
NPY-Y1 NPY1R NPYR neuropeptide Y receptor Y1
Type:
Enzyme Catalytic Domain
Mol. Mass.:
44399.07
Organism:
Homo sapiens (Human)
Description:
NPY-Y1 NPY1R HUMAN::P25929
Residue:
384
  
Inhibitor
Name:
BDBM50553107
Synonyms:
CHEMBL4746035
Type:
Small organic molecule
Emp. Form.:
C34H39F4N7O7
Mol. Mass.:
733.7098
SMILES:
OC(=O)C(F)(F)F.N\C(NCCC[C@@H](NC(=O)C(c1ccccc1)c1ccccc1)C(=O)NCc1ccc(O)cc1)=N\C(=O)NCCNC(=O)CF
: