Target
Cholesterol side-chain cleavage enzyme, mitochondrial
Ligand
BDBM32203
Substrate
Meas. Tech.
ChEMBL_2045980 (CHEMBL4700679)
IC50
110000±n/a nM
Citation
 Zhang, B Comprehensive review on the anti-bacterial activity of 1,2,3-triazole hybrids. Eur J Med Chem 168:357-372 (2019)  
Target
Name:
Cholesterol side-chain cleavage enzyme, mitochondrial
Synonyms:
CP11A_RAT Cyp11a-1 Cytochrome P450 11A1
Type:
PROTEIN
Mol. Mass.:
60603.33
Organism:
Rattus norvegicus
Description:
ChEMBL_50353
Residue:
526
  
Inhibitor
Name:
BDBM32203
Synonyms:
8-quinolinol US10005735, Table 1.7 cid_1923 quinolin-8-ol
Type:
Small organic molecule
Emp. Form.:
C9H7NO
Mol. Mass.:
145.158
SMILES:
Oc1cccc2cccnc12
: