Target
Neuropeptide FF receptor 2
Ligand
BDBM50553312
Substrate
Meas. Tech.
ChEMBL_2046248 (CHEMBL4700947)
EC50
140±n/a nM
Citation
 Pflimlin, ELear, SLee, CYu, SZou, HTo, AJoseph, SNguyen-Tran, VTremblay, MSShen, W Design of a Long-Acting and Selective MEG-Fatty Acid Stapled Prolactin-Releasing Peptide Analog. ACS Med Chem Lett 10:1166-1172 (2019)  
Target
Name:
Neuropeptide FF receptor 2
Synonyms:
G-protein coupled receptor 74 GPR74 NPFF2_HUMAN NPGPR Neuropeptide G-protein coupled receptor
Type:
Enzyme Catalytic Domain
Mol. Mass.:
60293.78
Organism:
Homo sapiens (Human)
Description:
NPFF2 0 HUMAN::Q9Y5X5
Residue:
522
  
Inhibitor
Name:
BDBM50553312
Synonyms:
CHEMBL4745052
Type:
Small organic molecule
Emp. Form.:
C193H315N57O52S2
Mol. Mass.:
4330.047
SMILES:
CCCCCCCCCCCCCCCCCC(=O)NCCOCCOCCNC(=O)CCOCCOCCNC(=O)[C@H]1CCCNC(=O)CSC[C@H](NC(=O)[C@H](CCC(N)=O)NC(=O)[C@H](Cc2cnc[nH]2)NC(=O)[C@H](C)NC(=O)[C@H](CCCNC(N)=N)NC(=O)[C@@H](N)CO)C(=O)N[C@@H](CO)C(=O)N[C@@H](CCCC)C(=O)N[C@@H](CCC(O)=O)C(=O)N[C@@H]([C@@H](C)O)C(=O)N[C@@H](CCCNC(N)=N)C(=O)N[C@@H]([C@@H](C)O)C(=O)N[C@@H](CSCC(=O)N1)C(=O)N[C@@H](CC(O)=O)C(=O)N[C@@H]([C@@H](C)CC)C(=O)N[C@@H](CC(N)=O)C(=O)N1CCC[C@H]1C(=O)N[C@@H](C)C(=O)N[C@@H](Cc1c[nH]c2ccccc12)C(=O)N[C@@H](Cc1ccc(O)cc1)C(=O)N[C@@H]([C@@H](C)O)C(=O)NCC(=O)N[C@@H](CCCCNC(N)=N)C(=O)NCC(=O)N[C@@H]([C@@H](C)CC)C(=O)N[C@@H](CCCNC(N)=N)C(=O)N1CCC[C@H]1C(=O)N[C@@H](C(C)C)C(=O)NCC(=O)N[C@@H](CCCNC(N)=N)C(=O)N[C@@H](Cc1ccccc1)C(N)=O
: