Target
Proto-oncogene tyrosine-protein kinase Src
Ligand
BDBM14680
Substrate
Meas. Tech.
ChEMBL_202774 (CHEMBL809531)
IC50
300000±n/a nM
Citation
 Lesuisse, DLange, GDeprez, PBénard, DSchoot, BDelettre, GMarquette, JPBroto, PJean-Baptiste, VBichet, PSarubbi, EMandine, E SAR and X-ray. A new approach combining fragment-based screening and rational drug design: application to the discovery of nanomolar inhibitors of Src SH2. J Med Chem 45:2379-87 (2002)  
Target
Name:
Proto-oncogene tyrosine-protein kinase Src
Synonyms:
Calmodulin/Proto-oncogene tyrosine-protein kinase Src Proto-oncogene c-Src SRC SRC_HUMAN V-src sarcoma (Schmidt-Ruppin A-2) viral oncogene homolog (avian) p60-Src | pp60c-src
Type:
Protein
Mol. Mass.:
59838.60
Organism:
Homo sapiens (Human)
Description:
P12931
Residue:
536
  
Inhibitor
Name:
BDBM14680
Synonyms:
2-formylphenoxyphosphonic acid CHEMBL286678 RU78262
Type:
Small organic molecule
Emp. Form.:
C7H7O5P
Mol. Mass.:
202.1012
SMILES:
OP(O)(=O)Oc1ccccc1C=O
: