Target
Proto-oncogene tyrosine-protein kinase Src
Ligand
BDBM14677
Substrate
Meas. Tech.
ChEMBL_202779 (CHEMBL873263)
IC50
3230000000±n/a nM
Citation
 Lesuisse, DLange, GDeprez, PBénard, DSchoot, BDelettre, GMarquette, JPBroto, PJean-Baptiste, VBichet, PSarubbi, EMandine, E SAR and X-ray. A new approach combining fragment-based screening and rational drug design: application to the discovery of nanomolar inhibitors of Src SH2. J Med Chem 45:2379-87 (2002)  
Target
Name:
Proto-oncogene tyrosine-protein kinase Src
Synonyms:
Calmodulin/Proto-oncogene tyrosine-protein kinase Src Proto-oncogene c-Src SRC SRC_HUMAN V-src sarcoma (Schmidt-Ruppin A-2) viral oncogene homolog (avian) p60-Src | pp60c-src
Type:
Protein
Mol. Mass.:
59838.60
Organism:
Homo sapiens (Human)
Description:
P12931
Residue:
536
  
Inhibitor
Name:
BDBM14677
Synonyms:
2-phenyl-2-sulfoacetic acid Fragment 7 phenyl(sulfo)acetic acid
Type:
Small organic molecule
Emp. Form.:
C8H8O5S
Mol. Mass.:
216.211
SMILES:
OC(=O)C(c1ccccc1)S(O)(=O)=O
: