Target
Macrophage migration inhibitory factor
Ligand
BDBM50113770
Substrate
Meas. Tech.
ChEMBL_103857 (CHEMBL712975)
IC50
100000±n/a nM
Citation
 Dios, AMitchell, RAAljabari, BLubetsky, JO'Connor, KLiao, HSenter, PDManogue, KRLolis, EMetz, CBucala, RCallaway, DJAl-Abed, Y Inhibition of MIF bioactivity by rational design of pharmacological inhibitors of MIF tautomerase activity. J Med Chem 45:2410-6 (2002)  
Target
Name:
Macrophage migration inhibitory factor
Synonyms:
GIF Glycosylation-inhibiting factor L-dopachrome tautomerase MIF/CD74 (Macrophage migration inhibitory factor and HLA-DR antigens-associated invariant chain) MMIF Macrophage migration inhibitory factor (MIF) | Phenylpyruvate tautomerase
Type:
Enzyme
Mol. Mass.:
12478.18
Organism:
Homo sapiens (Human)
Description:
P14174
Residue:
115
  
Inhibitor
Name:
BDBM50113770
Synonyms:
4-Hydroxy-2-[(4-hydroxy-benzylidene)-amino]-butyric acid methyl ester | CHEMBL2367595
Type:
Small organic molecule
Emp. Form.:
C12H15NO4
Mol. Mass.:
237.2518
SMILES:
COC(=O)[C@H](CCO)\N=C\c1ccc(O)cc1
: