Target
Cyclin-T1/Cyclin-dependent kinase 9
Ligand
BDBM50553486
Substrate
Meas. Tech.
ChEMBL_2046773 (CHEMBL4701472)
Ki
1.7±n/a nM
Citation
 Wu, TQin, ZTian, YWang, JXu, CLi, ZBian, J Recent Developments in the Biology and Medicinal Chemistry of CDK9 Inhibitors: An Update. J Med Chem 63:13228-13257 (2020)  
Target
Name:
Cyclin-T1/Cyclin-dependent kinase 9
Synonyms:
CDK9/ Cyclin-T1 CDK9/Cyclin T Cyclin T1/dependent kinase 9 | Cyclin-Dependent Kinase 9 (CDK9)
Type:
Protein Complex
Mol. Mass.:
Description:
Components:
This complex has 2 components.
Component 1
Name:
Cyclin-T1
Synonyms:
CCNT1 CycT Cyclin T Cyclin-T
Type:
Enzyme Subunit
Mol. Mass.:
80712.40
Organism:
Homo sapiens (Human)
Description:
Residue:
726
  
Component 2
Name:
Cyclin-dependent kinase 9
Synonyms:
C-2K CDK9 Cell division cycle 2-like protein kinase 4 Cyclin-Dependent Kinase 9 (CDK9) Serine/threonine-protein kinase PITALRE Tat-associated kinase complex catalytic subunit
Type:
Enzyme Subunit
Mol. Mass.:
42789.13
Organism:
Homo sapiens (Human)
Description:
Residue:
372
  
Inhibitor
Name:
BDBM50553486
Synonyms:
CHEMBL4782409
Type:
Small organic molecule
Emp. Form.:
C22H20ClF3NO8P
Mol. Mass.:
549.818
SMILES:
CN1CC[C@H]([C@@H]1CO)c1c(OP(O)(O)=O)cc(O)c2c1oc(cc2=O)-c1ccc(cc1Cl)C(F)(F)F
: