Target
Metabotropic glutamate receptor 7
Ligand
BDBM50553632
Substrate
Meas. Tech.
ChEMBL_2047019 (CHEMBL4701718)
IC50
410±n/a nM
Citation
 Kalbfleisch, JJReed, CWPark, CSpearing, PKQuitalig, MCJenkins, MTRodriguez, ALBlobaum, ALConn, PJNiswender, CMLindsley, CW Synthesis and SAR of a series of mGlu Bioorg Med Chem Lett 30:0 (2020)  
Target
Name:
Metabotropic glutamate receptor 7
Synonyms:
GRM7_RAT Grm7 Metabotropic glutamate receptor 7 (mGlu7) mGlu7
Type:
Enzyme
Mol. Mass.:
102244.48
Organism:
Rattus norvegicus (Rat)
Description:
P35400
Residue:
915
  
Inhibitor
Name:
BDBM50553632
Synonyms:
CHEMBL4745605
Type:
Small organic molecule
Emp. Form.:
C25H22N2O3S
Mol. Mass.:
430.519
SMILES:
CCOC(=O)c1cnc2c(OC)cccc2c1-c1ccc(nc1)-c1ccccc1SC
: