Target
Mu-type opioid receptor
Ligand
BDBM50070386
Substrate
Meas. Tech.
ChEMBL_2047156 (CHEMBL4701855)
Ki
0.140000±n/a nM
Citation
 Gonzalez, SDumitrascuta, MEiselt, ELouis, SKunze, LBlasiol, AVivancos, MPreviti, SDewolf, EMartin, CTourwé, DCavelier, FGendron, LSarret, PSpetea, MBallet, S Optimized Opioid-Neurotensin Multitarget Peptides: From Design to Structure-Activity Relationship Studies. J Med Chem 63:12929-12941 (2020)  
Target
Name:
Mu-type opioid receptor
Synonyms:
M-OR-1 MOR-1 MUOR1 Mu opiate receptor OPRM1 hMOP | mu-type opioid receptor isoform MOR-1
Type:
G Protein-Coupled Receptor (GPCR)
Mol. Mass.:
44789.51
Organism:
Homo sapiens (Human)
Description:
P35372
Residue:
400
  
Inhibitor
Name:
BDBM50070386
Synonyms:
CHEMBL3408737
Type:
Small organic molecule
Emp. Form.:
C30H42N8O5
Mol. Mass.:
594.7051
SMILES:
[H][C@@]1(Cc2ccccc2CN(CCC(N)=O)C1=O)NC(=O)[C@@H](CCCNC(N)=N)NC(=O)[C@@H](N)Cc1c(C)cc(O)cc1C
: